Reaction Details
TargetSerine/threonine-protein kinase Chk1
LigandBDBM50245693
Substrate/Competitorn/a
Meas. Tech.ChEMBL_511069 (CHEMBL1000361)
IC50 5±n/a nM
Citation Smaill, JBBaker, ENBooth, RJBridges, AJDickson, JMDobrusin, EMIvanovic, IKraker, AJLee, HHLunney, EAOrtwine, DFPalmer, BDQuin, JSquire, CJThompson, AMDenny, WA Synthesis and structure-activity relationships of N-6 substituted analogues of 9-hydroxy-4-phenylpyrrolo[3,4-c]carbazole-1,3(2H,6H)-diones as inhibitors of Wee1 and Chk1 checkpoint kinases. Eur J Med Chem43:1276-96 (2008) 
 
Serine/threonine-protein kinase Chk1
Name:Serine/threonine-protein kinase Chk1
Type:Enzyme Catalytic Domain
Mol. Mass.:54443.02
Organism:Homo sapiens (Human)
Description:gi_166295192
Residue:476
BDBM50245693
NameBDBM50245693
Synonyms:4-(2,6-dichlorophenyl)-9-hydroxy-6-(3-(methylamino)propyl)pyrrolo[3,4-c]carbazole-1,3(2H,6H)-dione | CHEMBL452336
TypeSmall organic molecule
Emp. Form.C24H19Cl2N3O3
Mol. Mass.468.332
SMILESCNCCCn1c2ccc(O)cc2c2c3C(=O)NC(=O)c3c(cc12)-c1c(Cl)cccc1Cl