Reaction Details
TargetSerine/threonine-protein kinase Chk1
LigandBDBM50245423
Substrate/Competitorn/a
Meas. Tech.ChEMBL_511069 (CHEMBL1000361)
IC50 1400±n/a nM
Citation Smaill, JBBaker, ENBooth, RJBridges, AJDickson, JMDobrusin, EMIvanovic, IKraker, AJLee, HHLunney, EAOrtwine, DFPalmer, BDQuin, JSquire, CJThompson, AMDenny, WA Synthesis and structure-activity relationships of N-6 substituted analogues of 9-hydroxy-4-phenylpyrrolo[3,4-c]carbazole-1,3(2H,6H)-diones as inhibitors of Wee1 and Chk1 checkpoint kinases. Eur J Med Chem43:1276-96 (2008) 
 
Serine/threonine-protein kinase Chk1
Name:Serine/threonine-protein kinase Chk1
Type:Enzyme Catalytic Domain
Mol. Mass.:54443.02
Organism:Homo sapiens (Human)
Description:gi_166295192
Residue:476
BDBM50245423
NameBDBM50245423
Synonyms:4-(2-Chlorophenyl)-9-hydroxy-6-[2-(1H-tetrazol-5-yl)-ethyl]pyrrolo[3,4-c]carbazole-1,3(2H,6H )-dione CHEMBL512342
TypeSmall organic molecule
Emp. Form.C23H15ClN6O3
Mol. Mass.458.857
SMILESOc1ccc2n(CCc3nnn[nH]3)c3cc(c4C(=O)NC(=O)c4c3c2c1)-c1ccccc1Cl