Reaction Details
TargetSerine/threonine-protein kinase Chk1
LigandBDBM50245548
Substrate/Competitorn/a
Meas. Tech.ChEMBL_511069 (CHEMBL1000361)
IC50 180±n/a nM
Citation Smaill, JBBaker, ENBooth, RJBridges, AJDickson, JMDobrusin, EMIvanovic, IKraker, AJLee, HHLunney, EAOrtwine, DFPalmer, BDQuin, JSquire, CJThompson, AMDenny, WA Synthesis and structure-activity relationships of N-6 substituted analogues of 9-hydroxy-4-phenylpyrrolo[3,4-c]carbazole-1,3(2H,6H)-diones as inhibitors of Wee1 and Chk1 checkpoint kinases. Eur J Med Chem43:1276-96 (2008) 
 
Serine/threonine-protein kinase Chk1
Name:Serine/threonine-protein kinase Chk1
Type:Enzyme Catalytic Domain
Mol. Mass.:54443.02
Organism:Homo sapiens (Human)
Description:gi_166295192
Residue:476
BDBM50245548
NameBDBM50245548
Synonyms:4-(2-Chlorophenyl)-9-hydroxy-6-(3-methoxypropyl)-pyrrolo[3,4-c]carbazole-1,3(2H,6H )-dione CHEMBL488054
TypeSmall organic molecule
Emp. Form.C24H19ClN2O4
Mol. Mass.434.872
SMILESCOCCCn1c2ccc(O)cc2c2c3C(=O)NC(=O)c3c(cc12)-c1ccccc1Cl