Reaction Details
TargetProto-oncogene tyrosine-protein kinase Src
LigandBDBM50245573
Substrate/Competitorn/a
Meas. Tech.ChEMBL_511308 (CHEMBL996963)
IC50 31000±n/a nM
Citation Smaill, JBBaker, ENBooth, RJBridges, AJDickson, JMDobrusin, EMIvanovic, IKraker, AJLee, HHLunney, EAOrtwine, DFPalmer, BDQuin, JSquire, CJThompson, AMDenny, WA Synthesis and structure-activity relationships of N-6 substituted analogues of 9-hydroxy-4-phenylpyrrolo[3,4-c]carbazole-1,3(2H,6H)-diones as inhibitors of Wee1 and Chk1 checkpoint kinases. Eur J Med Chem43:1276-96 (2008) 
 
Proto-oncogene tyrosine-protein kinase Src
Name:Proto-oncogene tyrosine-protein kinase Src
Type:Protein
Mol. Mass.:59838.60
Organism:Homo sapiens (Human)
Description:P12931
Residue:536
BDBM50245573
NameBDBM50245573
Synonyms:6-(2-(dimethylamino)ethyl)-9-hydroxy-4-phenylpyrrolo[3,4-c]carbazole-1,3(2H,6H)-dione | CHEMBL519891
TypeSmall organic molecule
Emp. Form.C24H21N3O3
Mol. Mass.399.4418
SMILESCN(C)CCn1c2ccc(O)cc2c2c3C(=O)NC(=O)c3c(cc12)-c1ccccc1