Reaction Details
TargetWee1-like protein kinase
LigandBDBM50245257
Substrate/Competitorn/a
Meas. Tech.ChEMBL_511068 (CHEMBL1000360)
IC50 82±n/a nM
Citation Smaill, JBBaker, ENBooth, RJBridges, AJDickson, JMDobrusin, EMIvanovic, IKraker, AJLee, HHLunney, EAOrtwine, DFPalmer, BDQuin, JSquire, CJThompson, AMDenny, WA Synthesis and structure-activity relationships of N-6 substituted analogues of 9-hydroxy-4-phenylpyrrolo[3,4-c]carbazole-1,3(2H,6H)-diones as inhibitors of Wee1 and Chk1 checkpoint kinases. Eur J Med Chem43:1276-96 (2008) 
 
Wee1-like protein kinase
Name:Wee1-like protein kinase
Type:PROTEIN
Mol. Mass.:71599.12
Organism:Homo sapiens (Human)
Description:ChEMBL_1445054
Residue:646
BDBM50245257
NameBDBM50245257
Synonyms:4-(2-chlorophenyl)-9-hydroxy-6-(3-(4-methylpiperazin-1-yl)propyl)pyrrolo[3,4-c]carbazole-1,3(2H,6H)-dione | CHEMBL508412
TypeSmall organic molecule
Emp. Form.C28H27ClN4O3
Mol. Mass.502.992
SMILESCN1CCN(CCCn2c3ccc(O)cc3c3c4C(=O)NC(=O)c4c(cc23)-c2ccccc2Cl)CC1