Reaction Details
TargetWee1-like protein kinase
LigandBDBM50245145
Substrate/Competitorn/a
Meas. Tech.ChEMBL_511068 (CHEMBL1000360)
IC50 64±n/a nM
Citation Smaill, JBBaker, ENBooth, RJBridges, AJDickson, JMDobrusin, EMIvanovic, IKraker, AJLee, HHLunney, EAOrtwine, DFPalmer, BDQuin, JSquire, CJThompson, AMDenny, WA Synthesis and structure-activity relationships of N-6 substituted analogues of 9-hydroxy-4-phenylpyrrolo[3,4-c]carbazole-1,3(2H,6H)-diones as inhibitors of Wee1 and Chk1 checkpoint kinases. Eur J Med Chem43:1276-96 (2008) 
 
Wee1-like protein kinase
Name:Wee1-like protein kinase
Type:PROTEIN
Mol. Mass.:71599.12
Organism:Homo sapiens (Human)
Description:ChEMBL_1445054
Residue:646
BDBM50245145
NameBDBM50245145
Synonyms:4-(2,6-dichlorophenyl)-9-hydroxy-6-(3-morpholinopropyl)pyrrolo[3,4-c]carbazole-1,3(2H,6H)-dione | CHEMBL486828
TypeSmall organic molecule
Emp. Form.C27H23Cl2N3O4
Mol. Mass.524.395
SMILESOc1ccc2n(CCCN3CCOCC3)c3cc(c4C(=O)NC(=O)c4c3c2c1)-c1c(Cl)cccc1Cl