Reaction Details
TargetWee1-like protein kinase
LigandBDBM50245691
Substrate/Competitorn/a
Meas. Tech.ChEMBL_511068 (CHEMBL1000360)
IC50 280±n/a nM
Citation Smaill, JBBaker, ENBooth, RJBridges, AJDickson, JMDobrusin, EMIvanovic, IKraker, AJLee, HHLunney, EAOrtwine, DFPalmer, BDQuin, JSquire, CJThompson, AMDenny, WA Synthesis and structure-activity relationships of N-6 substituted analogues of 9-hydroxy-4-phenylpyrrolo[3,4-c]carbazole-1,3(2H,6H)-diones as inhibitors of Wee1 and Chk1 checkpoint kinases. Eur J Med Chem43:1276-96 (2008) 
 
Wee1-like protein kinase
Name:Wee1-like protein kinase
Type:PROTEIN
Mol. Mass.:71599.12
Organism:Homo sapiens (Human)
Description:ChEMBL_1445054
Residue:646
BDBM50245691
NameBDBM50245691
Synonyms:9-hydroxy-6-(3-(methylamino)propyl)-4-phenylpyrrolo[3,4-c]carbazole-1,3(2H,6H)-dione | CHEMBL455192
TypeSmall organic molecule
Emp. Form.C24H21N3O3
Mol. Mass.399.4418
SMILESCNCCCn1c2ccc(O)cc2c2c3C(=O)NC(=O)c3c(cc12)-c1ccccc1