Reaction Details
TargetWee1-like protein kinase
LigandBDBM50245386
Substrate/Competitorn/a
Meas. Tech.ChEMBL_511068 (CHEMBL1000360)
IC50 12±n/a nM
Citation Smaill, JBBaker, ENBooth, RJBridges, AJDickson, JMDobrusin, EMIvanovic, IKraker, AJLee, HHLunney, EAOrtwine, DFPalmer, BDQuin, JSquire, CJThompson, AMDenny, WA Synthesis and structure-activity relationships of N-6 substituted analogues of 9-hydroxy-4-phenylpyrrolo[3,4-c]carbazole-1,3(2H,6H)-diones as inhibitors of Wee1 and Chk1 checkpoint kinases. Eur J Med Chem43:1276-96 (2008) 
 
Wee1-like protein kinase
Name:Wee1-like protein kinase
Type:PROTEIN
Mol. Mass.:71599.12
Organism:Homo sapiens (Human)
Description:ChEMBL_1445054
Residue:646
BDBM50245386
NameBDBM50245386
Synonyms:3-(4-(2-chlorophenyl)-9-hydroxy-1,3-dioxo-2,3-dihydropyrrolo[3,4-c]carbazol-6(1H)-yl)-N-(methylsulfonyl)propanamide N-[3-(4-(2-Chlorophenyl)-9-hydroxy-1,3-dioxo-2,3-dihydropyrrolo[3,4-c]carbazol-6(1H )-yl)-propanoyl]methanesulfonamide
TypeSmall organic molecule
Emp. Form.C24H18ClN3O6S
Mol. Mass.511.934
SMILESCS(=O)(=O)NC(=O)CCn1c2ccc(O)cc2c2c3C(=O)NC(=O)c3c(cc12)-c1ccccc1Cl