Reaction Details
TargetCyclin-dependent kinase 1
LigandBDBM50247391
Substrate/Competitorn/a
Meas. Tech.ChEMBL_519477 (CHEMBL951783)
IC50 4300±n/a nM
Citation Logé, CTestard, AThiéry, VLozach, OBlairvacq, MRobert, JMMeijer, LBesson, T Novel 9-oxo-thiazolo[5,4-f]quinazoline-2-carbonitrile derivatives as dual cyclin-dependent kinase 1 (CDK1)/glycogen synthase kinase-3 (GSK-3) inhibitors: synthesis, biological evaluation and molecular modeling studies. Eur J Med Chem43:1469-77 (2008) 
 
Cyclin-dependent kinase 1
Name:Cyclin-dependent kinase 1
Type:Enzyme Subunit
Mol. Mass.:34101.08
Organism:Homo sapiens (Human)
Description:P06493
Residue:297
BDBM50247391
NameBDBM50247391
Synonyms:8-Ethyl-9-oxo-8,9-dihydro-thiazolo[5,4-f]quinazoline-2-carboximidic acid isopropyl ester | CHEMBL453130
TypeSmall organic molecule
Emp. Form.C15H16N4O2S
Mol. Mass.316.378
SMILESCCn1cnc2ccc3nc(sc3c2c1=O)C(=N)OC(C)C