Reaction Details
TargetGlycogen synthase kinase-3 alpha
LigandBDBM50247393
Substrate/Competitorn/a
Meas. Tech.ChEMBL_519479 (CHEMBL951785)
IC50 170±n/a nM
Citation Logé, CTestard, AThiéry, VLozach, OBlairvacq, MRobert, JMMeijer, LBesson, T Novel 9-oxo-thiazolo[5,4-f]quinazoline-2-carbonitrile derivatives as dual cyclin-dependent kinase 1 (CDK1)/glycogen synthase kinase-3 (GSK-3) inhibitors: synthesis, biological evaluation and molecular modeling studies. Eur J Med Chem43:1469-77 (2008) 
 
Glycogen synthase kinase-3 alpha
Name:Glycogen synthase kinase-3 alpha
Type:Enzyme
Mol. Mass.:50991.79
Organism:Homo sapiens (Human)
Description:P49840
Residue:483
BDBM50247393
NameBDBM50247393
Synonyms:8-Ethyl-9-oxo-8,9-dihydro-thiazolo[5,4-f]quinazoline-2-carboximidic acid benzyl ester | CHEMBL453132
TypeSmall organic molecule
Emp. Form.C19H16N4O2S
Mol. Mass.364.421
SMILESCCn1cnc2ccc3nc(sc3c2c1=O)C(=N)OCc1ccccc1