Reaction Details
TargetGlycogen synthase kinase-3 alpha
LigandBDBM50247396
Substrate/Competitorn/a
Meas. Tech.ChEMBL_519479 (CHEMBL951785)
IC50 260±n/a nM
Citation Logé, CTestard, AThiéry, VLozach, OBlairvacq, MRobert, JMMeijer, LBesson, T Novel 9-oxo-thiazolo[5,4-f]quinazoline-2-carbonitrile derivatives as dual cyclin-dependent kinase 1 (CDK1)/glycogen synthase kinase-3 (GSK-3) inhibitors: synthesis, biological evaluation and molecular modeling studies. Eur J Med Chem43:1469-77 (2008) 
 
Glycogen synthase kinase-3 alpha
Name:Glycogen synthase kinase-3 alpha
Type:Enzyme
Mol. Mass.:50991.79
Organism:Homo sapiens (Human)
Description:P49840
Residue:483
BDBM50247396
NameBDBM50247396
Synonyms:8-Isopropyl-9-oxo-8,9-dihydro-thiazolo[5,4-f]quinazoline-2-carboximidic acid isopropyl ester | CHEMBL454126
TypeSmall organic molecule
Emp. Form.C16H18N4O2S
Mol. Mass.330.405
SMILESCC(C)OC(=N)c1nc2ccc3ncn(C(C)C)c(=O)c3c2s1