Reaction Details
TargetDelta-type opioid receptor
LigandBDBM50265437
Substrate/Competitorn/a
Meas. Tech.ChEMBL_497293 (CHEMBL995855)
Ki>10000±n/a nM
Citation Mercer, SLShaikh, JTraynor, JRMatsumoto, RRCoop, A Nitrile analogs of meperidine as high affinity and selective sigma-1 receptor ligands. Eur J Med Chem43:1304-8 (2008) 
 
Delta-type opioid receptor
Name:Delta-type opioid receptor
Type:G Protein-Coupled Receptor (GPCR)
Mol. Mass.:40382.98
Organism:Homo sapiens (Human)
Description:Competition binding assays were carried out using membrane preparations from transfected HN9.10 cells that constitutively expressed the delta opioid receptor.
Residue:372
BDBM50265437
NameBDBM50265437
Synonyms:1-Phenylbutyl-4-phenylpiperidine-4-carbonitrile | CHEMBL495760
TypeSmall organic molecule
Emp. Form.C22H26N2
Mol. Mass.318.4552
SMILESN#CC1(CCN(CCCCc2ccccc2)CC1)c1ccccc1