Reaction Details
TargetDelta-type opioid receptor
LigandBDBM50265432
Substrate/Competitorn/a
Meas. Tech.ChEMBL_497293 (CHEMBL995855)
Ki 5000±n/a nM
Citation Mercer, SLShaikh, JTraynor, JRMatsumoto, RRCoop, A Nitrile analogs of meperidine as high affinity and selective sigma-1 receptor ligands. Eur J Med Chem43:1304-8 (2008) 
 
Delta-type opioid receptor
Name:Delta-type opioid receptor
Type:G Protein-Coupled Receptor (GPCR)
Mol. Mass.:40382.98
Organism:Homo sapiens (Human)
Description:Competition binding assays were carried out using membrane preparations from transfected HN9.10 cells that constitutively expressed the delta opioid receptor.
Residue:372
BDBM50265432
NameBDBM50265432
Synonyms:1-(2-Methylallyl)-4-phenylpiperidine-4-carbonitrile | CHEMBL495548
TypeSmall organic molecule
Emp. Form.C16H20N2
Mol. Mass.240.3434
SMILESCC(=C)CN1CCC(CC1)(C#N)c1ccccc1