Reaction Details
TargetKappa-type opioid receptor
LigandBDBM50265432
Substrate/Competitorn/a
Meas. Tech.ChEMBL_497292 (CHEMBL995854)
Ki>10000±n/a nM
Citation Mercer, SLShaikh, JTraynor, JRMatsumoto, RRCoop, A Nitrile analogs of meperidine as high affinity and selective sigma-1 receptor ligands. Eur J Med Chem43:1304-8 (2008) 
 
Kappa-type opioid receptor
Name:Kappa-type opioid receptor
Type:G Protein-Coupled Receptor (GPCR)
Mol. Mass.:42648.76
Organism:Homo sapiens (Human)
Description:P41145
Residue:380
BDBM50265432
NameBDBM50265432
Synonyms:1-(2-Methylallyl)-4-phenylpiperidine-4-carbonitrile | CHEMBL495548
TypeSmall organic molecule
Emp. Form.C16H20N2
Mol. Mass.240.3434
SMILESCC(=C)CN1CCC(CC1)(C#N)c1ccccc1