Reaction Details
TargetCannabinoid receptor 1
LigandBDBM50242451
Substrate/Competitorn/a
Meas. Tech.ChEMBL_534264 (CHEMBL966862)
EC50 0.35±n/a nM
Citation Heimann, ASGomes, IDale, CSPagano, RLGupta, Ade Souza, LLLuchessi, ADCastro, LMGiorgi, RRioli, VFerro, ESDevi, LA Hemopressin is an inverse agonist of CB1 cannabinoid receptors. Proc Natl Acad Sci U S A104:20588-93 (2007) 
 
Cannabinoid receptor 1
Name:Cannabinoid receptor 1
Type:G Protein-Coupled Receptor (GPCR)
Mol. Mass.:52856.55
Organism:Rattus norvegicus (rat)
Description:P20272
Residue:473
BDBM50242451
NameBDBM50242451
Synonyms:CHEMBL510801 | hemopressin
TypeSmall organic molecule
Emp. Form.C53H77N13O12
Mol. Mass.1088.2584
SMILESCC(C)C[C@H](NC(=O)[C@H](Cc1ccccc1)NC(=O)[C@H](CCCCN)NC(=O)[C@H](Cc1ccccc1)NC(=O)[C@H](CC(N)=O)NC(=O)[C@@H](NC(=O)[C@@H]1CCCN1)C(C)C)C(=O)N[C@@H](CO)C(=O)N[C@@H](Cc1cnc[nH]1)C(O)=O