Reaction Details
TargetCytochrome P450 2C9
LigandBDBM50251123
Substrate/Competitorn/a
Meas. Tech.ChEMBL_529685 (CHEMBL972103)
Ki 5930±n/a nM
Citation Peng, CCRushmore, TCrouch, GJJones, JP Modeling and synthesis of novel tight-binding inhibitors of cytochrome P450 2C9. Bioorg Med Chem16:4064-74 (2008) 
 
Cytochrome P450 2C9
Name:Cytochrome P450 2C9
Type:Enzyme
Mol. Mass.:55636.33
Organism:Homo sapiens (Human)
Description:P11712
Residue:490
BDBM50251123
NameBDBM50251123
Synonyms:3-(4-methoxybenzoyl)-2-methyl-4H-chromen-4-one | CHEMBL465716
TypeSmall organic molecule
Emp. Form.C18H14O4
Mol. Mass.294.3014
SMILESCOc1ccc(cc1)C(=O)c1c(C)oc2ccccc2c1=O