Reaction Details
TargetCytochrome P450 2C9
LigandBDBM50251135
Substrate/Competitorn/a
Meas. Tech.ChEMBL_529685 (CHEMBL972103)
Ki 3120±n/a nM
Citation Peng, CCRushmore, TCrouch, GJJones, JP Modeling and synthesis of novel tight-binding inhibitors of cytochrome P450 2C9. Bioorg Med Chem16:4064-74 (2008) 
 
Cytochrome P450 2C9
Name:Cytochrome P450 2C9
Type:Enzyme
Mol. Mass.:55636.33
Organism:Homo sapiens (Human)
Description:P11712
Residue:490
BDBM50251135
NameBDBM50251135
Synonyms:3-(4-methoxybenzoyl)-2-propyl-4H-chromen-4-one | CHEMBL459249
TypeSmall organic molecule
Emp. Form.C20H18O4
Mol. Mass.322.3545
SMILESCCCc1oc2ccccc2c(=O)c1C(=O)c1ccc(OC)cc1