Reaction Details
TargetCannabinoid receptor 1
LigandBDBM50247390
Substrate/Competitorn/a
Meas. Tech.ChEMBL_518637 (CHEMBL962782)
Ki 16000±n/a nM
Citation Menozzi, GFossa, PCichero, ESpallarossa, ARanise, AMosti, L Rational design, synthesis and biological evaluation of new 1,5-diarylpyrazole derivatives as CB1 receptor antagonists, structurally related to rimonabant. Eur J Med Chem43:2627-38 (2008) 
 
Cannabinoid receptor 1
Name:Cannabinoid receptor 1
Type:G Protein-Coupled Receptor (GPCR)
Mol. Mass.:52868.96
Organism:Homo sapiens (Human)
Description:P21554
Residue:472
BDBM50247390
NameBDBM50247390
Synonyms:5-(4-Chlorophenyl)-1-(2,4-dichlorophenyl)-N-(4-methylpiperazin-1-yl)-1H-pyrazole-4-carboxamide | CHEMBL507595
TypeSmall organic molecule
Emp. Form.C21H20Cl3N5O
Mol. Mass.464.775
SMILESCN1CCN(CC1)NC(=O)c1cnn(c1-c1ccc(Cl)cc1)-c1ccc(Cl)cc1Cl