Reaction Details
TargetCannabinoid receptor 2
LigandBDBM50247416
Substrate/Competitorn/a
Meas. Tech.ChEMBL_518639 (CHEMBL962784)
Ki 30000±n/a nM
Citation Menozzi, GFossa, PCichero, ESpallarossa, ARanise, AMosti, L Rational design, synthesis and biological evaluation of new 1,5-diarylpyrazole derivatives as CB1 receptor antagonists, structurally related to rimonabant. Eur J Med Chem43:2627-38 (2008) 
 
Cannabinoid receptor 2
Name:Cannabinoid receptor 2
Type:G Protein-Coupled Receptor (GPCR)
Mol. Mass.:39690.94
Organism:Homo sapiens (Human)
Description:P34972
Residue:360
BDBM50247416
NameBDBM50247416
Synonyms:5-(4-Bromophenyl)-1-(2,4-dichlorophenyl)-N-(4-methylpiperazin-1-yl)-1H-pyrazole-4-carboxamide | CHEMBL453106
TypeSmall organic molecule
Emp. Form.C21H20BrCl2N5O
Mol. Mass.509.226
SMILESCN1CCN(CC1)NC(=O)c1cnn(c1-c1ccc(Br)cc1)-c1ccc(Cl)cc1Cl