Reaction Details
TargetCannabinoid receptor 2
LigandBDBM50247430
Substrate/Competitorn/a
Meas. Tech.ChEMBL_518639 (CHEMBL962784)
Ki 1900±n/a nM
Citation Menozzi, GFossa, PCichero, ESpallarossa, ARanise, AMosti, L Rational design, synthesis and biological evaluation of new 1,5-diarylpyrazole derivatives as CB1 receptor antagonists, structurally related to rimonabant. Eur J Med Chem43:2627-38 (2008) 
 
Cannabinoid receptor 2
Name:Cannabinoid receptor 2
Type:G Protein-Coupled Receptor (GPCR)
Mol. Mass.:39690.94
Organism:Homo sapiens (Human)
Description:P34972
Residue:360
BDBM50247430
NameBDBM50247430
Synonyms:1-(2,4-Dichlorophenyl)-5-(4-iodophenyl)-N-piperidin-1-yl-1H-pyrazole-4-carboxamide | CHEMBL461737
TypeSmall organic molecule
Emp. Form.C21H19Cl2IN4O
Mol. Mass.541.212
SMILESClc1ccc(c(Cl)c1)-n1ncc(C(=O)NN2CCCCC2)c1-c1ccc(I)cc1