Reaction Details
TargetCarboxylic ester hydrolase
LigandBDBM50261292
Substrate/Competitorn/a
Meas. Tech.ChEMBL_531228 (CHEMBL983416)
IC50 12±n/a nM
Citation Decker, MKraus, BHeilmann, J Design, synthesis and pharmacological evaluation of hybrid molecules out of quinazolinimines and lipoic acid lead to highly potent and selective butyrylcholinesterase inhibitors with antioxidant properties. Bioorg Med Chem16:4252-61 (2008) 
 
Carboxylic ester hydrolase
Name:Carboxylic ester hydrolase
Type:Protein
Mol. Mass.:68842.83
Organism:Equus caballus (Horse)
Description:Q9N1N9
Residue:602
BDBM50261292
NameBDBM50261292
Synonyms:CHEMBL466744 | N-[6-Chloro-2,3-dihydropyrrolo[2,1-b]quinazolin-9(1H)-ylidene]octane-1,8-diamine
TypeSmall organic molecule
Emp. Form.C19H27ClN4
Mol. Mass.346.897
SMILESNCCCCCCCC\N=c1/n2CCCc2nc2cc(Cl)ccc12