Reaction Details
TargetTransient receptor potential cation channel subfamily V member 1
LigandBDBM20330
Substrate/Competitorn/a
Meas. Tech.ChEMBL_543203 (CHEMBL1017798)
Ki 50±n/a nM
Citation Lim, JOJin, MKRyu, HKang, DWLee, JPearce, LVTran, RToth, ABlumberg, PM Conformationally constrained analogues of N'-(4-tert-butylbenzyl)-N-(4-methylsulfonylaminobenzyl)thiourea as TRPV1 antagonists. Eur J Med Chem44:322-31 (2008) 
 
Transient receptor potential cation channel subfamily V member 1
Name:Transient receptor potential cation channel subfamily V member 1
Type:Transient Receptor
Mol. Mass.:94956.12
Organism:Rattus norvegicus (rat)
Description:O35433
Residue:838
BDBM20330
NameBDBM20330
Synonyms:3-[(4-tert-butylphenyl)methyl]-1-[(4-methanesulfonamido-3-methoxyphenyl)methyl]thiourea thiourea analogue, 3
TypeSmall organic molecule
Emp. Form.C21H29N3O3S2
Mol. Mass.435.603
SMILESCOc1cc(CNC(=S)NCc2ccc(cc2)C(C)(C)C)ccc1NS(C)(=O)=O