Reaction Details
TargetGlucagon-like peptide 1 receptor
LigandBDBM50261516
Substrate/Competitorn/a
Meas. Tech.ChEMBL_533246 (CHEMBL972348)
IC50 1.9±n/a nM
Citation Miranda, LPWinters, KAGegg, CVPatel, AAral, JLong, JZhang, JDiamond, SGuido, MStanislaus, SMa, MLi, HRose, MJPoppe, LVéniant, MM Design and synthesis of conformationally constrained glucagon-like peptide-1 derivatives with increased plasma stability and prolonged in vivo activity. J Med Chem51:2758-65 (2008) 
 
Glucagon-like peptide 1 receptor
Name:Glucagon-like peptide 1 receptor
Type:Enzyme
Mol. Mass.:53035.78
Organism:Homo sapiens (Human)
Description:P43220
Residue:463
BDBM50261516
NameBDBM50261516
Synonyms:CHEMBL499133 | c[Glu23-Lys27][Gly8]GLP-1(7-37)-NH2
TypeSmall organic molecule
Emp. Form.C151H229N41O44
Mol. Mass.3322.6823
SMILESCC[C@H](C)[C@H](NC(=O)[C@H](Cc1ccccc1)NC(=O)[C@@H]1CCCCNC(=O)CC[C@H](NC(=O)CNC(=O)[C@H](CCC(O)=O)NC(=O)[C@H](CC(C)C)NC(=O)[C@H](Cc2ccc(O)cc2)NC(=O)[C@H](CO)NC(=O)[C@H](CO)NC(=O)[C@@H](NC(=O)[C@H](CC(O)=O)NC(=O)[C@H](CO)NC(=O)[C@@H](NC(=O)[C@H](Cc2ccccc2)NC(=O)[C@@H](NC(=O)CNC(=O)[C@H](CCC(O)=O)NC(=O)CNC(=O)[C@@H](N)Cc2cnc[nH]2)[C@@H](C)O)[C@@H](C)O)C(C)C)C(=O)N[C@@H](C)C(=O)N[C@@H](C)C(=O)N[C@@H](CCCCN)C(=O)N1)C(=O)N[C@@H](C)C(=O)N[C@@H](Cc1c[nH]c2ccccc12)C(=O)N[C@@H](CC(C)C)C(=O)N[C@@H](C(C)C)C(=O)N[C@@H](CCCCN)C(=O)NCC(=O)N[C@@H](CCCN=C(N)N)C(=O)NCC(N)=O