Reaction Details
TargetGonadotropin-releasing hormone receptor
LigandBDBM50116222
Substrate/Competitorn/a
Meas. Tech.ChEMBL_555922 (CHEMBL956658)
Ki 7.5±n/a nM
Citation Betz, SFZhu, YFChen, CStruthers, RS Non-peptide gonadotropin-releasing hormone receptor antagonists. J Med Chem51:3331-48 (2008) 
 
Gonadotropin-releasing hormone receptor
Name:Gonadotropin-releasing hormone receptor
Type:Enzyme
Mol. Mass.:37749.45
Organism:Homo sapiens (Human)
Description:P30968
Residue:328
BDBM50116222
NameBDBM50116222
Synonyms:2-(4-Butyrylamino-phenyl)-8-(2-fluoro-benzyl)-3-{[methyl-(2-pyridin-2-yl-ethyl)-amino]-methyl}-5-oxo-5,8-dihydro-imidazo[1,2-a]pyrimidine-6-carboxylic acid 1-ethyl-propyl ester pentan-3-yl 8-(2-fluorobenzyl)-2-(4-butyramidophenyl)-3-((methyl(2-(pyridin-2-yl)ethyl)amino)methyl)-5-oxo-5,8-dihydroimidazo[1,2-a]pyrimidine-6-carboxylate
TypeSmall organic molecule
Emp. Form.C38H43FN6O4
Mol. Mass.666.7842
SMILESCCCC(=O)Nc1ccc(cc1)-c1nc2n(Cc3ccccc3F)cc(C(=O)OC(CC)CC)c(=O)n2c1CN(C)CCc1ccccn1