Reaction Details
TargetGonadotropin-releasing hormone receptor
LigandBDBM50127199
Substrate/Competitorn/a
Meas. Tech.ChEMBL_555922 (CHEMBL956658)
Ki 5.2±n/a nM
Citation Betz, SFZhu, YFChen, CStruthers, RS Non-peptide gonadotropin-releasing hormone receptor antagonists. J Med Chem51:3331-48 (2008) 
 
Gonadotropin-releasing hormone receptor
Name:Gonadotropin-releasing hormone receptor
Type:Enzyme
Mol. Mass.:37749.45
Organism:Homo sapiens (Human)
Description:P30968
Residue:328
BDBM50127199
NameBDBM50127199
Synonyms:2-tert-Butyl-8-(2-fluoro-benzyl)-6-(3-methoxy-phenyl)-7-methyl-3-{[methyl-(2-pyridin-2-yl-ethyl)-amino]-methyl}-8H-imidazo[1,2-a]pyrimidin-5-one CHEMBL50546
TypeSmall organic molecule
Emp. Form.C34H38FN5O2
Mol. Mass.567.6962
SMILESCOc1cccc(c1)-c1c(C)n(Cc2ccccc2F)c2nc(c(CN(C)CCc3ccccn3)n2c1=O)C(C)(C)C