Reaction Details
TargetGonadotropin-releasing hormone receptor
LigandBDBM50149254
Substrate/Competitorn/a
Meas. Tech.ChEMBL_555922 (CHEMBL956658)
Ki 8.1±n/a nM
Citation Betz, SFZhu, YFChen, CStruthers, RS Non-peptide gonadotropin-releasing hormone receptor antagonists. J Med Chem51:3331-48 (2008) 
 
Gonadotropin-releasing hormone receptor
Name:Gonadotropin-releasing hormone receptor
Type:Enzyme
Mol. Mass.:37749.45
Organism:Homo sapiens (Human)
Description:P30968
Residue:328
BDBM50149254
NameBDBM50149254
Synonyms:(S)-1-(2,6-difluorobenzyl)-5-(2-fluoro-3-methoxyphenyl)-6-methyl-3-(2-(methylamino)-3-phenylpropyl)pyrimidine-2,4(1H,3H)-dione CHEMBL324912
TypeSmall organic molecule
Emp. Form.C29H28F3N3O3
Mol. Mass.523.5461
SMILESCN[C@@H](Cc1ccccc1)Cn1c(=O)c(c(C)n(Cc2c(F)cccc2F)c1=O)-c1cccc(OC)c1F