Reaction Details
TargetGonadotropin-releasing hormone receptor
LigandBDBM50261241
Substrate/Competitorn/a
Meas. Tech.ChEMBL_555922 (CHEMBL956658)
Ki 4.4±n/a nM
Citation Betz, SFZhu, YFChen, CStruthers, RS Non-peptide gonadotropin-releasing hormone receptor antagonists. J Med Chem51:3331-48 (2008) 
 
Gonadotropin-releasing hormone receptor
Name:Gonadotropin-releasing hormone receptor
Type:Enzyme
Mol. Mass.:37749.45
Organism:Homo sapiens (Human)
Description:P30968
Residue:328
BDBM50261241
NameBDBM50261241
Synonyms:1-(2-fluoro-6-(methylsulfinyl)benzyl)-3-((R)-2-amino-2-phenylethyl)-5-(2-fluoro-3-methoxyphenyl)-6-methylpyrimidine-2,4(1H,3H)-dione | CHEMBL466730
TypeSmall organic molecule
Emp. Form.C28H27F2N3O4S
Mol. Mass.539.593
SMILESCOc1cccc(c1F)-c1c(C)n(Cc2c(F)cccc2S(C)=O)c(=O)n(C[C@H](N)c2ccccc2)c1=O