Reaction Details
TargetGonadotropin-releasing hormone receptor
LigandBDBM50161999
Substrate/Competitorn/a
Meas. Tech.ChEMBL_555922 (CHEMBL956658)
Ki 6±n/a nM
Citation Betz, SFZhu, YFChen, CStruthers, RS Non-peptide gonadotropin-releasing hormone receptor antagonists. J Med Chem51:3331-48 (2008) 
 
Gonadotropin-releasing hormone receptor
Name:Gonadotropin-releasing hormone receptor
Type:Enzyme
Mol. Mass.:37749.45
Organism:Homo sapiens (Human)
Description:P30968
Residue:328
BDBM50161999
NameBDBM50161999
Synonyms:(R)-1-(2,6-difluorobenzyl)-3-(2-amino-2-phenylethyl)-5-(2-fluorophenyl)-6-methylpyrimidine-2,4(1H,3H)-dione CHEMBL359810
TypeSmall organic molecule
Emp. Form.C26H22F3N3O2
Mol. Mass.465.467
SMILESCc1c(-c2ccccc2F)c(=O)n(C[C@H](N)c2ccccc2)c(=O)n1Cc1c(F)cccc1F