Reaction Details
TargetGonadotropin-releasing hormone receptor
LigandBDBM50261181
Substrate/Competitorn/a
Meas. Tech.ChEMBL_555922 (CHEMBL956658)
Ki 2.3±n/a nM
Citation Betz, SFZhu, YFChen, CStruthers, RS Non-peptide gonadotropin-releasing hormone receptor antagonists. J Med Chem51:3331-48 (2008) 
 
Gonadotropin-releasing hormone receptor
Name:Gonadotropin-releasing hormone receptor
Type:Enzyme
Mol. Mass.:37749.45
Organism:Homo sapiens (Human)
Description:P30968
Residue:328
BDBM50261181
NameBDBM50261181
Synonyms:(R)-2-(2-fluoro-6-(trifluoromethyl)benzyl)-4-(2-amino-2-phenylethyl)-6-(2-chloro-3-methoxyphenyl)-1,2,4-triazine-3,5(2H,4H)-dione | CHEMBL539167
TypeSmall organic molecule
Emp. Form.C26H21ClF4N4O3
Mol. Mass.548.917
SMILESCOc1cccc(c1Cl)-c1nn(Cc2c(F)cccc2C(F)(F)F)c(=O)n(C[C@H](N)c2ccccc2)c1=O