Reaction Details
TargetGonadotropin-releasing hormone receptor
LigandBDBM50166436
Substrate/Competitorn/a
Meas. Tech.ChEMBL_555922 (CHEMBL956658)
Ki 5.3±n/a nM
Citation Betz, SFZhu, YFChen, CStruthers, RS Non-peptide gonadotropin-releasing hormone receptor antagonists. J Med Chem51:3331-48 (2008) 
 
Gonadotropin-releasing hormone receptor
Name:Gonadotropin-releasing hormone receptor
Type:Enzyme
Mol. Mass.:37749.45
Organism:Homo sapiens (Human)
Description:P30968
Residue:328
BDBM50166436
NameBDBM50166436
Synonyms:(R)-1-(2,6-difluorobenzyl)-3-(2-amino-2-phenylethyl)-5-(2-fluoro-3-methoxyphenyl)pyrimidine-2,4(1H,3H)-dione 3-((R)-2-Amino-2-phenyl-ethyl)-1-(2,6-difluoro-benzyl)-5-(2-fluoro-3-methoxy-phenyl)-1H-pyrimidine-2,4-dione | CHEMBL191817
TypeSmall organic molecule
Emp. Form.C26H22F3N3O3
Mol. Mass.481.4664
SMILESCOc1cccc(c1F)-c1cn(Cc2c(F)cccc2F)c(=O)n(C[C@H](N)c2ccccc2)c1=O