Reaction Details
TargetGonadotropin-releasing hormone receptor
LigandBDBM50213665
Substrate/Competitorn/a
Meas. Tech.ChEMBL_555924 (CHEMBL956660)
IC50 0.2±n/a nM
Citation Betz, SFZhu, YFChen, CStruthers, RS Non-peptide gonadotropin-releasing hormone receptor antagonists. J Med Chem51:3331-48 (2008) 
 
Gonadotropin-releasing hormone receptor
Name:Gonadotropin-releasing hormone receptor
Type:PROTEIN
Mol. Mass.:37767.60
Organism:Rattus norvegicus
Description:ChEMBL_1335047
Residue:327
BDBM50213665
NameBDBM50213665
Synonyms:(S)-1-(3-(1-(4-(1H-tetrazol-5-yl)phenethylamino)propan-2-yl)-2-(3,5-dimethylphenyl)-6,7-dihydro-1H-pyrrolo[3,2-c]pyridin-5(4H)-yl)-2-(2-fluoro-6-(trifluoromethyl)phenyl)ethanone | CHEMBL413245
TypeSmall organic molecule
Emp. Form.C36H37F4N7O
Mol. Mass.659.7189
SMILESC[C@H](CNCCc1ccc(cc1)-c1nnn[nH]1)c1c2CN(CCc2[nH]c1-c1cc(C)cc(C)c1)C(=O)Cc1c(F)cccc1C(F)(F)F