Reaction Details
TargetTyrosine-protein phosphatase non-receptor type 1
LigandBDBM50266231
Substrate/Competitorn/a
Meas. Tech.ChEMBL_544688 (CHEMBL1010126)
Ki 36300±n/a nM
Citation Kumar, AAhmad, PMaurya, RASingh, ABSrivastava, AK Novel 2-aryl-naphtho[1,2-d]oxazole derivatives as potential PTP-1B inhibitors showing antihyperglycemic activities. Eur J Med Chem44:109-16 (2008) 
 
Tyrosine-protein phosphatase non-receptor type 1
Name:Tyrosine-protein phosphatase non-receptor type 1
Type:Protein phosphatase
Mol. Mass.:49963.76
Organism:Homo sapiens (Human)
Description:Human recombinant GST-fusion PTP1B (1-435).
Residue:435
BDBM50266231
NameBDBM50266231
Synonyms:CHEMBL510460 | Dimethyl-[3-(4-naphtho[1,2-d]oxazol-2-yl-phenoxy)-propyl]-amine
TypeSmall organic molecule
Emp. Form.C22H22N2O2
Mol. Mass.346.4223
SMILESCN(C)CCCOc1ccc(cc1)-c1nc2c(ccc3ccccc23)o1