Reaction Details
Target11-beta-hydroxysteroid dehydrogenase 1
LigandBDBM50261010
Substrate/Competitorn/a
Meas. Tech.ChEMBL_552254 (CHEMBL995584)
IC50 0.98±n/a nM
Citation Zhu, YOlson, SHHermanowski-Vosatka, AMundt, SShah, KSpringer, MThieringer, RWright, SXiao, JZokian, HBalkovec, JM 4-Methyl-5-phenyl triazoles as selective inhibitors of 11beta-hydroxysteroid dehydrogenase type I. Bioorg Med Chem Lett18:3405-11 (2008) 
 
11-beta-hydroxysteroid dehydrogenase 1
Name:11-beta-hydroxysteroid dehydrogenase 1
Type:Enzyme
Mol. Mass.:32409.16
Organism:Homo sapiens (Human)
Description:P28845
Residue:292
BDBM50261010
NameBDBM50261010
Synonyms:3-(3-Chloro-2'-ethanesulfonyl-biphenyl-4-yl)-5-[1-(4-chloro-phenyl)-cyclobutyl]-4-methyl-4H-[1,2,4]triazole | CHEMBL496307
TypeSmall organic molecule
Emp. Form.C27H25Cl2N3O2S
Mol. Mass.526.477
SMILESCCS(=O)(=O)c1ccccc1-c1ccc(-c2nnc(n2C)C2(CCC2)c2ccc(Cl)cc2)c(Cl)c1