Reaction Details
TargetMatrilysin
LigandBDBM50260800
Substrate/Competitorn/a
Meas. Tech.ChEMBL_552274 (CHEMBL995604)
Ki 625±n/a nM
Citation Subramaniam, RHaldar, MKTobwala, SGanguly, BSrivastava, DKMallik, S Novel bis-(arylsulfonamide) hydroxamate-based selective MMP inhibitors. Bioorg Med Chem Lett18:3333-7 (2008) 
 
Matrilysin
Name:Matrilysin
Type:Enzyme
Mol. Mass.:29681.54
Organism:Homo sapiens (Human)
Description:P09237
Residue:267
BDBM50260800
NameBDBM50260800
Synonyms:2,3-bis(4-fluorophenylsulfonamido)-N-hydroxypropanamide | CHEMBL496716
TypeSmall organic molecule
Emp. Form.C15H15F2N3O6S2
Mol. Mass.435.423
SMILESONC(=O)C(CNS(=O)(=O)c1ccc(F)cc1)NS(=O)(=O)c1ccc(F)cc1