Reaction Details
TargetThromboxane-A synthase
LigandBDBM50168766
Substrate/Competitorn/a
Meas. Tech.ChEMBL_553576 (CHEMBL958759)
IC50>1000±n/a nM
Citation Friesen, RWMancini, JA Microsomal prostaglandin E2 synthase-1 (mPGES-1): a novel anti-inflammatory therapeutic target. J Med Chem51:4059-67 (2008) 
 
Thromboxane-A synthase
Name:Thromboxane-A synthase
Type:Enzyme
Mol. Mass.:60524.67
Organism:Homo sapiens (Human)
Description:P24557
Residue:533
BDBM50168766
NameBDBM50168766
Synonyms:3-(1-(4-chlorobenzyl)-5-(2-fluoro-2'-methylbiphenyl-4-yl)-3-methyl-1H-indol-2-yl)-2,2-dimethylpropanoic acid CHEMBL180650
TypeSmall organic molecule
Emp. Form.C34H31ClFNO2
Mol. Mass.540.067
SMILESCc1c(CC(C)(C)C(O)=O)n(Cc2ccc(Cl)cc2)c2ccc(cc12)-c1ccc(c(F)c1)-c1ccccc1C