Reaction Details
TargetArachidonate 5-lipoxygenase-activating protein
LigandBDBM50168761
Substrate/Competitorn/a
Meas. Tech.ChEMBL_553560 (CHEMBL958743)
IC50>1000±n/a nM
Citation Friesen, RWMancini, JA Microsomal prostaglandin E2 synthase-1 (mPGES-1): a novel anti-inflammatory therapeutic target. J Med Chem51:4059-67 (2008) 
 
Arachidonate 5-lipoxygenase-activating protein
Name:Arachidonate 5-lipoxygenase-activating protein
Type:Enzyme
Mol. Mass.:18159.90
Organism:Homo sapiens (Human)
Description:P20292
Residue:161
BDBM50168761
NameBDBM50168761
Synonyms:3-(1-(4-chlorobenzyl)-5-(2-fluorobiphenyl-4-yl)-3-methyl-1H-indol-2-yl)-2,2-dimethylpropanoic acid CHEMBL182032
TypeSmall organic molecule
Emp. Form.C33H29ClFNO2
Mol. Mass.526.04
SMILESCc1c(CC(C)(C)C(O)=O)n(Cc2ccc(Cl)cc2)c2ccc(cc12)-c1ccc(c(F)c1)-c1ccccc1