Reaction Details
TargetThymidylate kinase
LigandBDBM50246637
Substrate/Competitorn/a
Meas. Tech.ChEMBL_556415 (CHEMBL954907)
Ki 10000±n/a nM
Citation Gasse, CDouguet, DHuteau, VMarchal, GMunier-Lehmann, HPochet, S Substituted benzyl-pyrimidines targeting thymidine monophosphate kinase of Mycobacterium tuberculosis: synthesis and in vitro anti-mycobacterial activity. Bioorg Med Chem16:6075-85 (2008) 
 
Thymidylate kinase
Name:Thymidylate kinase
Type:PROTEIN
Mol. Mass.:22636.29
Organism:Mycobacterium tuberculosis
Description:ChEMBL_208218
Residue:214
BDBM50246637
NameBDBM50246637
Synonyms:5-chloro-1-((2R,4S,5R)-4-hydroxy-5-(hydroxymethyl)-tetrahydrofuran-2-yl)pyrimidine-2,4(1H,3H)-dione Chlorodeoxyuridine
TypeSmall organic molecule
Emp. Form.C9H11ClN2O5
Mol. Mass.262.647
SMILESOC[C@H]1O[C@H](C[C@@H]1O)n1cc(Cl)c(=O)[nH]c1=O