Reaction Details
TargetDelta-type opioid receptor
LigandBDBM50199865
Substrate/Competitorn/a
Meas. Tech.ChEMBL_556446 (CHEMBL955663)
Ki 5±n/a nM
Citation Koda, YDel Borgo, MWessling, STLazarus, LHOkada, YToth, IBlanchfield, JT Synthesis and in vitro evaluation of a library of modified endomorphin 1 peptides. Bioorg Med Chem16:6286-96 (2008) 
 
Delta-type opioid receptor
Name:Delta-type opioid receptor
Type:G Protein-Coupled Receptor (GPCR)
Mol. Mass.:40465.04
Organism:Rattus norvegicus (rat)
Description:Competition binding assays were using CHO-K1 cell membranes expressing the opioid receptor.
Residue:372
BDBM50199865
NameBDBM50199865
Synonyms:(S)-N-((S)-1-((S)-1-amino-1-oxo-3-phenylpropan-2-ylamino)-3-(1H-indol-3-yl)-1-oxopropan-2-yl)-1-((S)-2-amino-3-(4-hydroxy-2,6-dimethylphenyl)propanoyl)pyrrolidine-2-carboxamide | CHEMBL412923
TypeSmall organic molecule
Emp. Form.C36H42N6O5
Mol. Mass.638.7559
SMILESCc1cc(O)cc(C)c1C[C@H](N)C(=O)N1CCC[C@H]1C(=O)N[C@@H](Cc1c[nH]c2ccccc12)C(=O)N[C@@H](Cc1ccccc1)C(N)=O