Reaction Details
TargetProstaglandin G/H synthase 1
LigandBDBM50247272
Substrate/Competitorn/a
Meas. Tech.ChEMBL_518948 (CHEMBL941536)
IC50 51300±n/a nM
Citation Kang, SSCuendet, MEndringer, DCCroy, VLPezzuto, JMLipton, MA Synthesis and biological evaluation of a library of resveratrol analogues as inhibitors of COX-1, COX-2 and NF-kappaB. Bioorg Med Chem17:1044-54 (2009) 
 
Prostaglandin G/H synthase 1
Name:Prostaglandin G/H synthase 1
Type:Enzyme
Mol. Mass.:68692.62
Organism:Homo sapiens (Human)
Description:P23219
Residue:599
BDBM50247272
NameBDBM50247272
Synonyms:5-(4-fluorostyryl)benzene-1,3-diol Stilbene, 8f
TypeSmall organic molecule
Emp. Form.C14H11FO2
Mol. Mass.230.2343
SMILESOc1cc(O)cc(\C=C\c2ccc(F)cc2)c1