Reaction Details
TargetSigma non-opioid intracellular receptor 1
LigandBDBM50267387
Substrate/Competitorn/a
Meas. Tech.ChEMBL_563916 (CHEMBL965019)
Ki>10000±n/a nM
Citation Bedürftig, SWünsch, B 1,4-Diazepanes derived from (S)-serine--homopiperazines with improved sigma(1) (sigma) receptor affinity and selectivity. Eur J Med Chem44:519-25 (2009) 
 
Sigma non-opioid intracellular receptor 1
Name:Sigma non-opioid intracellular receptor 1
Type:Protein
Mol. Mass.:25307.17
Organism:Cavia porcellus (Guinea pig)
Description:Q60492
Residue:223
BDBM50267387
NameBDBM50267387
Synonyms:(R)-(1-benzyl-4-(2,2-dimethoxyethyl)piperazin-2-yl)methanol | CHEMBL477037
TypeSmall organic molecule
Emp. Form.C16H26N2O3
Mol. Mass.294.3892
SMILESCOC(CN1CCN(Cc2ccccc2)[C@@H](CO)C1)OC