Reaction Details
TargetNitric oxide synthase, endothelial
LigandBDBM50270530
Substrate/Competitorn/a
Meas. Tech.ChEMBL_552620 (CHEMBL957264)
IC50 13000±n/a nM
Citation Cottyn, BAcher, FRamassamy, BAlvey, LLepoivre, MFrapart, YStuehr, DMansuy, DBoucher, JLVichard, D Inhibitory effects of a series of 7-substituted-indazoles toward nitric oxide synthases: particular potency of 1H-indazole-7-carbonitrile. Bioorg Med Chem16:5962-73 (2008) 
 
Nitric oxide synthase, endothelial
Name:Nitric oxide synthase, endothelial
Type:Enzyme
Mol. Mass.:133292.26
Organism:Bos taurus (bovine)
Description:Recombinant eNOS overexpressed in E. coli was used in enzyme assays.
Residue:1205
BDBM50270530
NameBDBM50270530
Synonyms:3-Bromo-1H-indazole-7-carbonitrile | CHEMBL451541
TypeSmall organic molecule
Emp. Form.C8H4BrN3
Mol. Mass.222.041
SMILESBrc1n[nH]c2c(cccc12)C#N