Reaction Details
TargetMu-type opioid receptor
LigandBDBM50244247
Substrate/Competitorn/a
Meas. Tech.ChEMBL_554778 (CHEMBL953931)
IC50 7400±n/a nM
Citation Yoshizumi, TMiyazoe, HIto, HTsujita, TTakahashi, HAsai, MOzaki, SOhta, HOkamoto, O Design, synthesis, and structure-activity relationship study of a novel class of ORL1 receptor antagonists based on N-biarylmethyl spiropiperidine. Bioorg Med Chem Lett18:3778-82 (2008) 
 
Mu-type opioid receptor
Name:Mu-type opioid receptor
Type:G Protein-Coupled Receptor (GPCR)
Mol. Mass.:44789.51
Organism:Homo sapiens (Human)
Description:P35372
Residue:400
BDBM50244247
NameBDBM50244247
Synonyms:1'-{[1-(3-chloropyridin-2-yl)-3-methyl-1H-pyrazol-4-yl]methyl}-3H-spiro[2-benzofuran-1,4'-piperidine] | CHEMBL512520
TypeSmall organic molecule
Emp. Form.C22H23ClN4O
Mol. Mass.394.897
SMILESCc1nn(cc1CN1CCC2(CC1)OCc1ccccc21)-c1ncccc1Cl