Reaction Details
TargetMu-type opioid receptor
LigandBDBM50244177
Substrate/Competitorn/a
Meas. Tech.ChEMBL_554778 (CHEMBL953931)
IC50 3200±n/a nM
Citation Yoshizumi, TMiyazoe, HIto, HTsujita, TTakahashi, HAsai, MOzaki, SOhta, HOkamoto, O Design, synthesis, and structure-activity relationship study of a novel class of ORL1 receptor antagonists based on N-biarylmethyl spiropiperidine. Bioorg Med Chem Lett18:3778-82 (2008) 
 
Mu-type opioid receptor
Name:Mu-type opioid receptor
Type:G Protein-Coupled Receptor (GPCR)
Mol. Mass.:44789.51
Organism:Homo sapiens (Human)
Description:P35372
Residue:400
BDBM50244177
NameBDBM50244177
Synonyms:1'-[(3-methyl-1-phenyl-1H-pyrazol-4-yl)methyl]-3H-spiro[2-benzofuran-1,4'-piperidine] | CHEMBL460893
TypeSmall organic molecule
Emp. Form.C23H25N3O
Mol. Mass.359.4641
SMILESCc1nn(cc1CN1CCC2(CC1)OCc1ccccc21)-c1ccccc1