Reaction Details
TargetCannabinoid receptor 2
LigandBDBM50243719
Substrate/Competitorn/a
Meas. Tech.ChEMBL_554591 (CHEMBL964505)
Ki 13.6±n/a nM
Citation Krishnamurthy, MGurley, SMoore, BM Exploring the substituent effects on a novel series of C1'-dimethyl-aryl Delta8-tetrahydrocannabinol analogs. Bioorg Med Chem16:6489-500 (2008) 
 
Cannabinoid receptor 2
Name:Cannabinoid receptor 2
Type:G Protein-Coupled Receptor (GPCR)
Mol. Mass.:39690.94
Organism:Homo sapiens (Human)
Description:P34972
Residue:360
BDBM50243719
NameBDBM50243719
Synonyms:CHEMBL471367 | N-{3-[1-(1-hydroxy-6,6,9-trimethyl)-6a,7,10,10atetrahydro-6H-benzo[c]chromen-3-yl-1-methyl-ethyl]-phenyl}acetamide
TypeSmall organic molecule
Emp. Form.C26H31NO3
Mol. Mass.405.5292
SMILESCC1=CC[C@@H]2[C@@H](C1)c1c(O)cc(cc1OC2(C)C)C(C)(C)c1ccc(cc1)C(N)=O