Reaction Details
TargetC-C chemokine receptor type 5
LigandBDBM50141884
Substrate/Competitorn/a
Meas. Tech.ChEMBL_500129 (CHEMBL974332)
IC50 1.2±n/a nM
Citation Zhuo, YKong, RCong, XJChen, WZWang, CX Three-dimensional QSAR analyses of 1,3,4-trisubstituted pyrrolidine-based CCR5 receptor inhibitors. Eur J Med Chem43:2724-34 (2008) 
 
C-C chemokine receptor type 5
Name:C-C chemokine receptor type 5
Type:Enzyme
Mol. Mass.:40540.21
Organism:Homo sapiens (Human)
Description:P51681
Residue:352
BDBM50141884
NameBDBM50141884
Synonyms:(R)-2-((3S,4S)-3-((4-(3-benzyl-1-ethyl-1H-pyrazol-5-yl)piperidin-1-yl)methyl)-4-(3-fluorophenyl)pyrrolidin-1-yl)-3-cyclobutylpropanoic acid CHEMBL173095
TypeSmall organic molecule
Emp. Form.C35H45FN4O2
Mol. Mass.572.7558
SMILESCCn1nc(Cc2ccccc2)cc1C1CCN(C[C@H]2CN(C[C@@H]2c2cccc(F)c2)[C@H](CC2CCC2)C(O)=O)CC1