Reaction Details
TargetC-C chemokine receptor type 5
LigandBDBM50249490
Substrate/Competitorn/a
Meas. Tech.ChEMBL_500129 (CHEMBL974332)
IC50 0.23±n/a nM
Citation Zhuo, YKong, RCong, XJChen, WZWang, CX Three-dimensional QSAR analyses of 1,3,4-trisubstituted pyrrolidine-based CCR5 receptor inhibitors. Eur J Med Chem43:2724-34 (2008) 
 
C-C chemokine receptor type 5
Name:C-C chemokine receptor type 5
Type:Enzyme
Mol. Mass.:40540.21
Organism:Homo sapiens (Human)
Description:P51681
Residue:352
BDBM50249490
NameBDBM50249490
Synonyms:(R)-2-((3S,4S)-3-((4-(2-benzylthiazol-5-yl)piperidin-1-yl)methyl)-4-phenylpyrrolidin-1-yl)-3-cyclopropylpropanoic acid | CHEMBL520091
TypeSmall organic molecule
Emp. Form.C32H39N3O2S
Mol. Mass.529.736
SMILESOC(=O)[C@@H](CC1CC1)N1C[C@H](CN2CCC(CC2)c2cnc(Cc3ccccc3)s2)[C@H](C1)c1ccccc1