Reaction Details
TargetC-C chemokine receptor type 5
LigandBDBM50249214
Substrate/Competitorn/a
Meas. Tech.ChEMBL_500129 (CHEMBL974332)
IC50 0.4±n/a nM
Citation Zhuo, YKong, RCong, XJChen, WZWang, CX Three-dimensional QSAR analyses of 1,3,4-trisubstituted pyrrolidine-based CCR5 receptor inhibitors. Eur J Med Chem43:2724-34 (2008) 
 
C-C chemokine receptor type 5
Name:C-C chemokine receptor type 5
Type:Enzyme
Mol. Mass.:40540.21
Organism:Homo sapiens (Human)
Description:P51681
Residue:352
BDBM50249214
NameBDBM50249214
Synonyms:1-(((3S,4S)-1-(cyclohexylmethyl)-4-phenylpyrrolidin-3-yl)methyl)-4-(3-(4-(2-methyl-2H-tetrazol-5-yl)phenyl)propyl)piperidin-4-ol | CHEMBL464132
TypeSmall organic molecule
Emp. Form.C34H48N6O
Mol. Mass.556.7845
SMILESCn1nnc(n1)-c1ccc(CCCC2(O)CCN(C[C@H]3CN(CC4CCCCC4)C[C@@H]3c3ccccc3)CC2)cc1