Reaction Details
TargetC-C chemokine receptor type 5
LigandBDBM50249304
Substrate/Competitorn/a
Meas. Tech.ChEMBL_500129 (CHEMBL974332)
IC50 1.5±n/a nM
Citation Zhuo, YKong, RCong, XJChen, WZWang, CX Three-dimensional QSAR analyses of 1,3,4-trisubstituted pyrrolidine-based CCR5 receptor inhibitors. Eur J Med Chem43:2724-34 (2008) 
 
C-C chemokine receptor type 5
Name:C-C chemokine receptor type 5
Type:Enzyme
Mol. Mass.:40540.21
Organism:Homo sapiens (Human)
Description:P51681
Residue:352
BDBM50249304
NameBDBM50249304
Synonyms:(R)-2-((3S,4S)-3-((4-(5-benzyloxazol-2-yl)piperidin-1-yl)methyl)-4-phenylpyrrolidin-1-yl)-2-cyclohexylacetic acid | CHEMBL481274
TypeSmall organic molecule
Emp. Form.C34H43N3O3
Mol. Mass.541.7235
SMILESOC(=O)[C@@H](C1CCCCC1)N1C[C@H](CN2CCC(CC2)c2ncc(Cc3ccccc3)o2)[C@H](C1)c1ccccc1