Reaction Details
TargetC-C chemokine receptor type 5
LigandBDBM50249366
Substrate/Competitorn/a
Meas. Tech.ChEMBL_500129 (CHEMBL974332)
IC50 0.57±n/a nM
Citation Zhuo, YKong, RCong, XJChen, WZWang, CX Three-dimensional QSAR analyses of 1,3,4-trisubstituted pyrrolidine-based CCR5 receptor inhibitors. Eur J Med Chem43:2724-34 (2008) 
 
C-C chemokine receptor type 5
Name:C-C chemokine receptor type 5
Type:Enzyme
Mol. Mass.:40540.21
Organism:Homo sapiens (Human)
Description:P51681
Residue:352
BDBM50249366
NameBDBM50249366
Synonyms:(R)-2-((3S,4S)-3-((4-(2-benzyl-4-ethyl-1H-imidazol-5-yl)piperidin-1-yl)methyl)-4-phenylpyrrolidin-1-yl)-3-cyclobutylpropanoic acid | CHEMBL500631
TypeSmall organic molecule
Emp. Form.C35H46N4O2
Mol. Mass.554.7653
SMILESCCc1nc(Cc2ccccc2)[nH]c1C1CCN(C[C@H]2CN(C[C@@H]2c2ccccc2)[C@H](CC2CCC2)C(O)=O)CC1