Reaction Details
TargetC-C chemokine receptor type 5
LigandBDBM50249367
Substrate/Competitorn/a
Meas. Tech.ChEMBL_500129 (CHEMBL974332)
IC50 0.6±n/a nM
Citation Zhuo, YKong, RCong, XJChen, WZWang, CX Three-dimensional QSAR analyses of 1,3,4-trisubstituted pyrrolidine-based CCR5 receptor inhibitors. Eur J Med Chem43:2724-34 (2008) 
 
C-C chemokine receptor type 5
Name:C-C chemokine receptor type 5
Type:Enzyme
Mol. Mass.:40540.21
Organism:Homo sapiens (Human)
Description:P51681
Residue:352
BDBM50249367
NameBDBM50249367
Synonyms:(R)-2-((3S,4S)-3-((4-(2-benzyl-4-chloro-1H-imidazol-5-yl)piperidin-1-yl)methyl)-4-phenylpyrrolidin-1-yl)-3-cyclobutylpropanoic acid | CHEMBL472412
TypeSmall organic molecule
Emp. Form.C33H41ClN4O2
Mol. Mass.561.157
SMILESOC(=O)[C@@H](CC1CCC1)N1C[C@H](CN2CCC(CC2)c2[nH]c(Cc3ccccc3)nc2Cl)[C@H](C1)c1ccccc1